{"text_format":"1","workbook":"xlsx","n_sheets":5,"sheets":["Interface","Food","Activities","TV","Sample"],"not_rendered":{"charts":0,"images":0,"macros":1,"external_links":0,"defined_names":0,"comments":0,"pivot_tables":0},"unopened":[],"bounds":{"document_bytes":16777216,"sheet_cells":100000,"rows_first":2000,"rows_last":500,"rows_between":2000,"halvings":0,"cell_chars":16384,"cell_head_chars":4096},"cells_cut":0,"cells_raw":0,"read":"whole","date_system":"1900"}

{"sheet":"Interface","index":0,"n_rows":26,"n_cols":4,"rows_kept":26,"cut":false,"hidden":false,"merged":[[0,4,6,4],[9,3,17,5],[34,0,34,2],[25,0,33,2],[0,1,6,1],[9,0,17,2],[25,3,33,5]]}
[]
[]
[]
[]
[]
[]
[]
[]
[]
[{"$f":"LOOKUP(RANDBETWEEN(1,Food!C2),Food!A1:A261,Food!B1:B579)","v":"Deli"},null,null,{"$f":"LOOKUP(RANDBETWEEN(1,Activities!C2),Activities!A1:A261,Activities!B1:B579)","v":"Skiing"}]
[]
[]
[]
[]
[]
[]
[]
[]
[]
[]
[]
[]
[]
[]
[]
[{"$f":"LOOKUP(RANDBETWEEN(1,TV!C2),TV!A1:A291,TV!B1:B609)","v":"70's Show"},null,null,{"$f":"LOOKUP(RANDBETWEEN(1,Sample!C2),Sample!A1:A291,Sample!B1:B609)","v":"Hi"}]

{"sheet":"Food","index":1,"n_rows":100,"n_cols":6,"rows_kept":100,"cut":false,"hidden":false,"merged":[[3,2,11,2]]}
[1,"Noodles","Possibilities"]
[2,"Noodles",{"$f":"COUNTA(B1:B100000)","v":39}]
[3,"Noodles"]
[4,"Noodles",{"$f":"LOOKUP(RANDBETWEEN(1,C2),A1:A200,B1:B200)","v":"Noodles"}]
[5,"Noodles"]
[6,"Pizza"]
[7,"Pizza"]
[8,"Pizza"]
[9,"Pizza"]
[10,"Sushi"]
[11,"Sushi"]
[12,"Sushi"]
[13,"Panera"]
[14,"Panera"]
[15,"Mexican"]
[16,"Mexican"]
[17,"Mexican"]
[18,"Chinese"]
[19,"Chinese"]
[20,"Indian"]
[21,"Indian"]
[22,"Indian"]
[23,"Sub Sandwhich"]
[24,"Sub Sandwhich",null,"Type","Importance (1-10)","Go"]
[25,"Sub Sandwhich",null,null,1]
[26,"Italian"]
[27,"Italian"]
[28,"Italian"]
[29,"Middle Eastern"]
[30,"Veggie/Vegan"]
[31,"Veggie/Vegan"]
[32,"Grill"]
[33,"Grill"]
[34,"Ethiopian"]
[35,"Deli"]
[36,"Deli"]
[37,"Deli"]
[38,"Seafood"]
[39,"Thai"]
[40]
[41]
[42]
[43]
[44]
[45]
[46]
[47]
[48]
[49]
[50]
[51]
[52]
[53]
[54]
[55]
[56]
[57]
[58]
[59]
[60]
[61]
[62]
[63]
[64]
[65]
[66]
[67]
[68]
[69]
[70]
[71]
[72]
[73]
[74]
[75]
[76]
[77]
[78]
[79]
[80]
[81]
[82]
[83]
[84]
[85]
[86]
[87]
[88]
[89]
[90]
[91]
[92]
[93]
[94]
[95]
[96]
[97]
[98]
[99]
[100]

{"sheet":"Activities","index":2,"n_rows":100,"n_cols":3,"rows_kept":100,"cut":false,"hidden":false,"merged":[[3,2,11,2]]}
[1,"Bowling","Possibilities"]
[2,"Ice Skating",{"$f":"COUNTA(B1:B100000)","v":32}]
[3,"Rock Climbing"]
[4,"Movies",{"$f":"LOOKUP(RANDBETWEEN(1,C2),A1:A200,B1:B200)","v":"Musical"}]
[5,"Putt Putt"]
[6,"Comedy Show"]
[7,"Archery"]
[8,"Tea House"]
[9,"Park"]
[10,"Musical"]
[11,"Movie"]
[12,"Skiing"]
[13,"Biking"]
[14,"Dance Class"]
[15,"Cooking Class"]
[16,"Planetarium"]
[17,"Berry Picking"]
[18,"Volunteering"]
[19,"Jazz Club"]
[20,"Massage Time"]
[21,"Concert"]
[22,"Art Museum"]
[23,"Sledding"]
[24,"Portuguese"]
[25,"Find New Activity"]
[26,"Learn Life Skill"]
[27,"Make A Fort"]
[28,"Yoga"]
[29,"Long Walk"]
[30,"Video Games"]
[31,"Arcade"]
[32,"Picnic"]
[33]
[34]
[35]
[36]
[37]
[38]
[39]
[40]
[41]
[42]
[43]
[44]
[45]
[46]
[47]
[48]
[49]
[50]
[51]
[52]
[53]
[54]
[55]
[56]
[57]
[58]
[59]
[60]
[61]
[62]
[63]
[64]
[65]
[66]
[67]
[68]
[69]
[70]
[71]
[72]
[73]
[74]
[75]
[76]
[77]
[78]
[79]
[80]
[81]
[82]
[83]
[84]
[85]
[86]
[87]
[88]
[89]
[90]
[91]
[92]
[93]
[94]
[95]
[96]
[97]
[98]
[99]
[100]

{"sheet":"TV","index":3,"n_rows":100,"n_cols":3,"rows_kept":100,"cut":false,"hidden":false,"merged":[[3,2,11,2]]}
[1,"70's Show","Possibilities"]
[2,"70's Show",{"$f":"COUNTA(B1:B100000)","v":18}]
[3,"70's Show"]
[4,"Seinfeld",{"$f":"LOOKUP(RANDBETWEEN(1,C2),A1:A200,B1:B200)","v":"Community"}]
[5,"Seinfeld"]
[6,"Seinfeld"]
[7,"Seinfeld"]
[8,"Community"]
[9,"Whose Line "]
[10,"Bones"]
[11,"Bones"]
[12,"The Mentalist"]
[13,"The Mentalist"]
[14,"Mindy Project"]
[15,"Arrested Dev."]
[16,"Ally McBeal"]
[17,"Orange New Black"]
[18,"It's Always Sunny"]
[19]
[20]
[21]
[22]
[23]
[24]
[25]
[26]
[27]
[28]
[29]
[30]
[31]
[32]
[33]
[34]
[35]
[36]
[37]
[38]
[39]
[40]
[41]
[42]
[43]
[44]
[45]
[46]
[47]
[48]
[49]
[50]
[51]
[52]
[53]
[54]
[55]
[56]
[57]
[58]
[59]
[60]
[61]
[62]
[63]
[64]
[65]
[66]
[67]
[68]
[69]
[70]
[71]
[72]
[73]
[74]
[75]
[76]
[77]
[78]
[79]
[80]
[81]
[82]
[83]
[84]
[85]
[86]
[87]
[88]
[89]
[90]
[91]
[92]
[93]
[94]
[95]
[96]
[97]
[98]
[99]
[100]

{"sheet":"Sample","index":4,"n_rows":100,"n_cols":3,"rows_kept":100,"cut":false,"hidden":false,"merged":[[3,2,11,2]]}
[1,"Hi","Possibilities"]
[2,"Hello",{"$f":"COUNTA(B1:B100000)","v":3}]
[3,"I Loooooooooooooove Yoooooooooooooouuuuuuuuuuuuu"]
[4,null,{"$f":"LOOKUP(RANDBETWEEN(1,C2),A1:A200,B1:B200)","v":"Hi"}]
[5]
[6]
[7]
[8]
[9]
[10]
[11]
[12]
[13]
[14]
[15]
[16]
[17]
[18]
[19]
[20]
[21]
[22]
[23]
[24]
[25]
[26]
[27]
[28]
[29]
[30]
[31]
[32]
[33]
[34]
[35]
[36]
[37]
[38]
[39]
[40]
[41]
[42]
[43]
[44]
[45]
[46]
[47]
[48]
[49]
[50]
[51]
[52]
[53]
[54]
[55]
[56]
[57]
[58]
[59]
[60]
[61]
[62]
[63]
[64]
[65]
[66]
[67]
[68]
[69]
[70]
[71]
[72]
[73]
[74]
[75]
[76]
[77]
[78]
[79]
[80]
[81]
[82]
[83]
[84]
[85]
[86]
[87]
[88]
[89]
[90]
[91]
[92]
[93]
[94]
[95]
[96]
[97]
[98]
[99]
[100]